BDBM50279631 4-(3-amino-4-chlorophenyl)-9-hydroxypyrrolo[3,4-c]carbazole-1,3(2H,6H)-dione::CHEMBL487335
SMILES Nc1cc(ccc1Cl)-c1cc2[nH]c3ccc(O)cc3c2c2C(=O)NC(=O)c12
InChI Key InChIKey=XXUXXRYTNNOIIO-UHFFFAOYSA-N
Data  1 IC50
  Tab Delimited (TSV)   2D SDfile   Computed 3D by Vconf -m prep SDfile
Find this compound or compounds like it in BindingDB:
Activity Spreadsheet -- Enzyme Inhibition Constant Data from BindingDB
Found 1 hit for monomerid = 50279631
TargetWee1-like protein kinase(Homo sapiens (Human))
Chulalongkorn University
Curated by ChEMBL
LigandPNGBDBM50279631(4-(3-amino-4-chlorophenyl)-9-hydroxypyrrolo[3,4-c]...)
Affinity DataIC50:  24nM. Assay description: Inhibition of human Wee1
In DepthDetails ArticlePubMed