BDBM50279839 CHEMBL157924::[4-(2-Amino-ethyl)-imidazol-1-yl]-phenyl-methanone
SMILES NCCc1cn(cn1)C(=O)c1ccccc1
InChI Key InChIKey=LGGPDUCDDGTTBT-UHFFFAOYSA-N
Data  1 KI
  Tab Delimited (TSV)   2D SDfile   Computed 3D by Vconf -m prep SDfile
Find this compound or compounds like it in BindingDB:
Activity Spreadsheet -- Enzyme Inhibition Constant Data from BindingDB
Found 1 hit for monomerid = 50279839
TargetBeta-glucosidase(Prunus avium)
TBA
Curated by ChEMBL
LigandPNGBDBM50279839(CHEMBL157924 | [4-(2-Amino-ethyl)-imidazol-1-yl]-p...)
Affinity DataKi:  110nM. Assay description: Inhibitory activity against sweet almond Beta-glucosidase
In DepthDetails Article