BDBM50280046 2-[2-(Naphthalen-2-yloxy)-ethyl]-3a,4,5,6-tetrahydro-2H-cyclopentapyrazol-3-one::CHEMBL154058
SMILES O=c1c2CCCc2[nH]n1CCOc1ccc2ccccc2c1
InChI Key InChIKey=ILWPUWFFYSLOPA-UHFFFAOYSA-N
Data  1 IC50
  Tab Delimited (TSV)   2D SDfile   Computed 3D by Vconf -m prep SDfile
Find this compound or compounds like it in BindingDB:
Activity Spreadsheet -- Enzyme Inhibition Constant Data from BindingDB
Found 1 hit for monomerid = 50280046
TargetPolyunsaturated fatty acid 5-lipoxygenase(Homo sapiens (Human))
TBA
Curated by ChEMBL
LigandPNGBDBM50280046(2-[2-(Naphthalen-2-yloxy)-ethyl]-3a,4,5,6-tetrahyd...)
Affinity DataIC50:  480nM. Assay description: Inhibition of [14C]-arachidonic acid conversion to 5-HETE by broken cell 5-LO isolated from guinea pig PMN
In DepthDetails Article