BDBM50280556 2,8-Dimethyl-8-aza-spiro[4.5]decane-1,3-dione::CHEMBL353781
SMILES CC1C(=O)CC2(CCN(C)CC2)C1=O
InChI Key InChIKey=JXTGLFXHNVZNOH-UHFFFAOYSA-N
Data  2 KI
  Tab Delimited (TSV)   2D SDfile   Computed 3D by Vconf -m prep SDfile
Find this compound or compounds like it in BindingDB:
Activity Spreadsheet -- Enzyme Inhibition Constant Data from BindingDB
Found 2 hits for monomerid = 50280556
LigandPNGBDBM50280556(2,8-Dimethyl-8-aza-spiro[4.5]decane-1,3-dione | CH...)
Affinity DataKi:  175nM. Assay description: In vitro 100 nM cortex affinity to displace [3H]- -CD providing a measure of muscarinic m1 receptor agonist affinity
In DepthDetails Article
LigandPNGBDBM50280556(2,8-Dimethyl-8-aza-spiro[4.5]decane-1,3-dione | CH...)
Affinity DataKi:  4.05E+3nM. Assay description: In vitro 100 nM cortex affinity to displace [3H]- -pirenzepine providing a measure of muscarinic m1 receptor antagonist affinity
In DepthDetails Article