BDBM50281499 4-[4-(4-Naphthalen-2-yl-3,6-dihydro-2H-pyridin-1-yl)-butyl]-pyridine::CHEMBL94950
SMILES C(CCc1ccncc1)CN1CCC(=CC1)c1ccc2ccccc2c1
InChI Key InChIKey=UFKFJODSTRHACQ-UHFFFAOYSA-N
Data  2 KI
  Tab Delimited (TSV)   2D SDfile   Computed 3D by Vconf -m prep SDfile
Find this compound or compounds like it in BindingDB:
Activity Spreadsheet -- Enzyme Inhibition Constant Data from BindingDB
Found 2 hits for monomerid = 50281499
TargetSigma non-opioid intracellular receptor 1(Homo sapiens (Human))
TBA
Curated by ChEMBL
LigandPNGBDBM50281499(4-[4-(4-Naphthalen-2-yl-3,6-dihydro-2H-pyridin-1-y...)
Affinity DataKi:  3.07nM. Assay description: Binding affinity against sigma receptor in guinea pig brain preparation was estimated using [3H]-3-PPP as radioligand
In DepthDetails Article
TargetD(2) dopamine receptor(Rattus norvegicus (rat))
TBA
Curated by ChEMBL
LigandPNGBDBM50281499(4-[4-(4-Naphthalen-2-yl-3,6-dihydro-2H-pyridin-1-y...)
Affinity DataKi:  660nM. Assay description: Binding affinity against Dopamine receptor D2 in rat striatum using [3H]-spiperone
In DepthDetails Article