BDBM50282207 5-[4'-(2,5-Dibutyl-2H-[1,2,4]triazol-3-ylmethyl)-biphenyl-2-yl]-1H-tetrazole::CHEMBL12909
SMILES CCCCc1nc(Cc2ccc(cc2)-c2ccccc2-c2nnn[nH]2)n(CCCC)n1
InChI Key InChIKey=XLXMXFXXYBNHJV-UHFFFAOYSA-N
Data  1 IC50
  Tab Delimited (TSV)   2D SDfile   Computed 3D by Vconf -m prep SDfile
Find this compound or compounds like it in BindingDB:
Activity Spreadsheet -- Enzyme Inhibition Constant Data from BindingDB
Found 1 hit for monomerid = 50282207
TargetType-1 angiotensin II receptor(Homo sapiens (Human))
The M. S. University Of Baroda
Curated by ChEMBL
LigandPNGBDBM50282207(5-[4'-(2,5-Dibutyl-2H-[1,2,4]triazol-3-ylmethyl)-b...)
Affinity DataIC50:  16nM. Assay description: Binding affinity to angiotensin AT1 receptor
In DepthDetails ArticlePubMed