BDBM50282268 4'-(2-Butyl-4-cyclopropyl-4-methyl-5-oxo-4,5-dihydro-imidazol-1-ylmethyl)-biphenyl-2-carboxylic acid::CHEMBL45485
SMILES CCCCC1=NC(C)(C2CC2)C(=O)N1Cc1ccc(cc1)-c1ccccc1C(O)=O
InChI Key InChIKey=YRNINDDFRJVSHB-UHFFFAOYSA-N
Data  1 IC50
  Tab Delimited (TSV)   2D SDfile   Computed 3D by Vconf -m prep SDfile
Find this compound or compounds like it in BindingDB:
Activity Spreadsheet -- Enzyme Inhibition Constant Data from BindingDB
Found 1 hit for monomerid = 50282268
LigandPNGBDBM50282268(4'-(2-Butyl-4-cyclopropyl-4-methyl-5-oxo-4,5-dihyd...)
Affinity DataIC50:  18nM. Assay description: In vitro binding affinity at Angiotensin II receptor, type 1 from rat liver membrane by [125I]- A II displacement.
In DepthDetails Article