BDBM50282863 4-Isopropoxy-1,1-dioxo-2-(1-phenyl-1H-tetrazol-5-ylsulfanylmethyl)-1,2-dihydro-1lambda*6*-benzo[d]isothiazol-3-one::CHEMBL50101
SMILES CC(C)Oc1cccc2c1C(=O)N(CSc1nnnn1-c1ccccc1)S2(=O)=O
InChI Key InChIKey=CYLMNDUCCYHCPN-UHFFFAOYSA-N
Data  1 KI
  Tab Delimited (TSV)   2D SDfile   Computed 3D by Vconf -m prep SDfile
Find this compound or compounds like it in BindingDB:
Activity Spreadsheet -- Enzyme Inhibition Constant Data from BindingDB
Found 1 hit for monomerid = 50282863
TargetNeutrophil elastase(Homo sapiens (Human))
TBA
Curated by ChEMBL
LigandPNGBDBM50282863(4-Isopropoxy-1,1-dioxo-2-(1-phenyl-1H-tetrazol-5-y...)
Affinity DataKi:  18nM. Assay description: Potency of Inhibition of human leukocyte elastase (HLE) expressed as apparent binding constant
In DepthDetails Article