BDBM50282867 4-tert-Butyl-1,1-dioxo-2-(1-phenyl-1H-tetrazol-5-ylsulfanylmethyl)-1,2-dihydro-1lambda*6*-benzo[d]isothiazol-3-one::CHEMBL300430
SMILES CC(C)(C)c1cccc2c1C(=O)N(CSc1nnnn1-c1ccccc1)S2(=O)=O
InChI Key InChIKey=IKOIUKCRVUDMIF-UHFFFAOYSA-N
Data  2 KI
  Tab Delimited (TSV)   2D SDfile   Computed 3D by Vconf -m prep SDfile
Find this compound or compounds like it in BindingDB:
Activity Spreadsheet -- Enzyme Inhibition Constant Data from BindingDB
Found 2 hits for monomerid = 50282867
TargetNeutrophil elastase(Homo sapiens (Human))
TBA
Curated by ChEMBL
LigandPNGBDBM50282867(4-tert-Butyl-1,1-dioxo-2-(1-phenyl-1H-tetrazol-5-y...)
Affinity DataKi:  2.00E+3nM. Assay description: Potency of Inhibition of human leukocyte elastase (HLE) expressed as apparent binding constant
In DepthDetails Article
TargetNeutrophil elastase(Homo sapiens (Human))
TBA
Curated by ChEMBL
LigandPNGBDBM50282867(4-tert-Butyl-1,1-dioxo-2-(1-phenyl-1H-tetrazol-5-y...)
Affinity DataKi: >2.00E+3nM. Assay description: Evaluated for inhibitory activity against Human leukocyte elastase (HLE)
In DepthDetails Article