BDBM50283355 CHEMBL311418::{(S)-1-[3-(Benzyl-methyl-carbamoyl)-1-(4-benzyloxy-benzyl)-3,3-difluoro-2-oxo-propylcarbamoyl]-2-methyl-propyl}-carbamic acid benzyl ester
SMILES CC(C)[C@H](NC(=O)OCc1ccccc1)C(=O)NC(Cc1ccc(OCc2ccccc2)cc1)C(=O)C(F)(F)C(=O)N(C)Cc1ccccc1
InChI Key InChIKey=CIGKLJDIMXPQJJ-DNKZHYAASA-N
Data  1 KI
  Tab Delimited (TSV)   2D SDfile   Computed 3D by Vconf -m prep SDfile
Find this compound or compounds like it in BindingDB:
Activity Spreadsheet -- Enzyme Inhibition Constant Data from BindingDB
Found 1 hit for monomerid = 50283355
TargetGag-Pol polyprotein [489-587](Human immunodeficiency virus type 1)
TBA
Curated by ChEMBL
LigandPNGBDBM50283355(CHEMBL311418 | {(S)-1-[3-(Benzyl-methyl-carbamoyl)...)
Affinity DataKi:  0.400nM. Assay description: Compound was tested for inactivation of purified HIV-1 protease in vitro
In DepthDetails Article