BDBM50283920 1-[1,1-Bis-(4-fluoro-phenyl)-silolan-3-yl]-4-phenyl-piperazine::CHEMBL134423
SMILES Fc1ccc(cc1)[Si]1(CCC(C1)N1CCN(CC1)c1ccccc1)c1ccc(F)cc1
InChI Key InChIKey=SUBRNIMHHUWIJU-UHFFFAOYSA-N
Data  8 IC50
  Tab Delimited (TSV)   2D SDfile   Computed 3D by Vconf -m prep SDfile
Find this compound or compounds like it in BindingDB:
Activity Spreadsheet -- Enzyme Inhibition Constant Data from BindingDB
Found 8 hits for monomerid = 50283920
TargetHistamine H1 receptor(Homo sapiens (Human))
TBA
Curated by ChEMBL
LigandPNGBDBM50283920(1-[1,1-Bis-(4-fluoro-phenyl)-silolan-3-yl]-4-pheny...)
Affinity DataIC50: >1.00E+3nM. Assay description: Binding affinity towards histamine H1 receptor
In DepthDetails Article
Target5-hydroxytryptamine receptor 2A(Rattus norvegicus (rat))
TBA
Curated by ChEMBL
LigandPNGBDBM50283920(1-[1,1-Bis-(4-fluoro-phenyl)-silolan-3-yl]-4-pheny...)
Affinity DataIC50:  2nM. Assay description: In vitro binding affinity towards serotonin 5-HT2A receptor in rat cortical membranes using [3H]ketanserin as radioligand
In DepthDetails Article
TargetMuscarinic acetylcholine receptor M4(Homo sapiens (Human))
TBA
Curated by ChEMBL
LigandPNGBDBM50283920(1-[1,1-Bis-(4-fluoro-phenyl)-silolan-3-yl]-4-pheny...)
Affinity DataIC50: >1.00E+3nM. Assay description: Binding affinity towards muscarinic receptor
In DepthDetails Article
Target5-hydroxytryptamine receptor 2A(Rattus norvegicus (rat))
TBA
Curated by ChEMBL
LigandPNGBDBM50283920(1-[1,1-Bis-(4-fluoro-phenyl)-silolan-3-yl]-4-pheny...)
Affinity DataIC50:  3nM. Assay description: In vitro binding affinity towards serotonin 5-HT2A receptor in rat cortical membranes using [3H]ketanserin as radioligand
In DepthDetails Article
TargetHistamine H1 receptor(Homo sapiens (Human))
TBA
Curated by ChEMBL
LigandPNGBDBM50283920(1-[1,1-Bis-(4-fluoro-phenyl)-silolan-3-yl]-4-pheny...)
Affinity DataIC50: >1.00E+3nM. Assay description: Binding affinity towards histamine H1 receptor
In DepthDetails Article
TargetD(2) dopamine receptor(Homo sapiens (Human))
TBA
Curated by ChEMBL
LigandPNGBDBM50283920(1-[1,1-Bis-(4-fluoro-phenyl)-silolan-3-yl]-4-pheny...)
Affinity DataIC50:  100nM. Assay description: Binding affinity towards dopamine D2 receptor
In DepthDetails Article
TargetMuscarinic acetylcholine receptor M4(Homo sapiens (Human))
TBA
Curated by ChEMBL
LigandPNGBDBM50283920(1-[1,1-Bis-(4-fluoro-phenyl)-silolan-3-yl]-4-pheny...)
Affinity DataIC50: >1.00E+3nM. Assay description: Binding affinity towards muscarinic receptor
In DepthDetails Article
TargetD(2) dopamine receptor(Homo sapiens (Human))
TBA
Curated by ChEMBL
LigandPNGBDBM50283920(1-[1,1-Bis-(4-fluoro-phenyl)-silolan-3-yl]-4-pheny...)
Affinity DataIC50:  100nM. Assay description: Binding affinity towards dopamine D2 receptor
In DepthDetails Article