BDBM50285245 CHEMBL432720::N-[(3S,5S)-2-Hydroxy-6-hydroxymethyl-5-((2S,4S,5S)-3,4,5-trihydroxy-6-methyl-tetrahydro-pyran-2-ylsulfanyl)-tetrahydro-pyran-3-yl]-acetamide
SMILES CC1OC(SC2CC(NC(C)=O)C(O)OC2CO)C(O)C(O)C1O
InChI Key InChIKey=BFMMTAWFEKZTJZ-UHFFFAOYSA-N
Data  1 KI
  Tab Delimited (TSV)   2D SDfile   Computed 3D by Vconf -m prep SDfile
Find this compound or compounds like it in BindingDB:
Activity Spreadsheet -- Enzyme Inhibition Constant Data from BindingDB
Found 1 hit for monomerid = 50285245
TargetTissue alpha-L-fucosidase(Homo sapiens (Human))
TBA
Curated by ChEMBL
LigandPNGBDBM50285245(CHEMBL432720 | N-[(3S,5S)-2-Hydroxy-6-hydroxymethy...)
Affinity DataKi:  2.40E+6nM. Assay description: Compound was tested for inhibitory activity (mixed) against alpha-L-fucosidase from bovine kidney
In DepthDetails Article