BDBM50286809 7,7a-Dihydro-1aH-1,3,5-trioxa-cyclopropa[a]-s-indacene::CHEMBL426223
SMILES C1Oc2cc3CC4OC4c3cc2O1
InChI Key InChIKey=FPKCBWYXZINSCN-UHFFFAOYSA-N
Data  1 KI
  Tab Delimited (TSV)   2D SDfile   Computed 3D by Vconf -m prep SDfile
Find this compound or compounds like it in BindingDB:
Activity Spreadsheet -- Enzyme Inhibition Constant Data from BindingDB
Found 1 hit for monomerid = 50286809
TargetDopamine beta-hydroxylase(Bos taurus)
TBA
Curated by ChEMBL
LigandPNGBDBM50286809(7,7a-Dihydro-1aH-1,3,5-trioxa-cyclopropa[a]-s-inda...)
Affinity DataKi:  1.01E+6nM. Assay description: Kinetic constant for inhibition (KI) of Dopamine beta-Hydroxylase(DBH) from bovine adrenal medulla
In DepthDetails Article