BDBM50287285 (S)-3-[5-(4-Carbamimidoyl-phenoxy)-pentanoylamino]-N-((S)-1-carboxy-2-hydroxy-ethyl)-succinamic acid::CHEMBL286356
SMILES NC(=N)c1ccc(OCCCCC(=O)N[C@@H](CC(O)=O)C(=O)N[C@@H](CO)C(O)=O)cc1
InChI Key InChIKey=DBZWVAUGUMRCJB-KBPBESRZSA-N
Data  2 IC50
  Tab Delimited (TSV)   2D SDfile   Computed 3D by Vconf -m prep SDfile
Find this compound or compounds like it in BindingDB:
Activity Spreadsheet -- Enzyme Inhibition Constant Data from BindingDB
Found 2 hits for monomerid = 50287285
TargetIntegrin alpha-IIb/beta-3(Homo sapiens (Human))
TBA
Curated by ChEMBL
LigandPNGBDBM50287285((S)-3-[5-(4-Carbamimidoyl-phenoxy)-pentanoylamino]...)
Affinity DataIC50:  1.20E+4nM. Assay description: Inhibition of ADP-induced human platelet aggregation
In DepthDetails Article
TargetIntegrin alpha-IIb/beta-3(Homo sapiens (Human))
TBA
Curated by ChEMBL
LigandPNGBDBM50287285((S)-3-[5-(4-Carbamimidoyl-phenoxy)-pentanoylamino]...)
Affinity DataIC50:  1.20E+4nM. Assay description: Inhibition of alphaIIb-beta3 integrin
In DepthDetails ArticlePubMed