BDBM50287645 1-[(S)-2-(3-Cyclohexyl-propionylamino)-3-methyl-butyryl]-piperidine-2-carboxylic acid ((S)-1-{(S)-2-[(1S,2R)-1-((S)-1-carbamoyl-3-methyl-butylcarbamoyl)-2-hydroxy-propylcarbamoyl]-pyrrolidine-1-carbonyl}-pentyl)-amide::CHEMBL2373021
SMILES CCCC[C@H](NC(=O)[C@@H]1CCCCN1C(=O)[C@@H](NC(=O)CCC1CCCCC1)C(C)C)C(=O)N1CCC[C@H]1C(=O)N[C@@H]([C@@H](C)O)C(=O)N[C@@H](CC(C)C)C(N)=O
InChI Key InChIKey=JXMAVBNVCNTIDU-KNOMIANTSA-N
Data  1 IC50
  Tab Delimited (TSV)   2D SDfile   Computed 3D by Vconf -m prep SDfile
Find this compound or compounds like it in BindingDB:
Activity Spreadsheet -- Enzyme Inhibition Constant Data from BindingDB
Found 1 hit for monomerid = 50287645
TargetTumor necrosis factor receptor superfamily member 10A(Homo sapiens (Human))
TBA
Curated by ChEMBL
LigandPNGBDBM50287645(1-[(S)-2-(3-Cyclohexyl-propionylamino)-3-methyl-bu...)
Affinity DataIC50:  755nM. Assay description: Compound was tested for its ability to compete for binding to DR4 using ELISA assay.
In DepthDetails Article