BDBM50287646 (S)-3-({1-[(2S,3R)-2-((R)-3-Cyclohexyl-butyrylamino)-3-hydroxy-butyryl]-piperidine-2-carbonyl}-amino)-4-[(S)-2-((1S,2R)-2-hydroxy-1-propylcarbamoyl-propylcarbamoyl)-pyrrolidin-1-yl]-4-oxo-butyric acid::CHEMBL2373028
SMILES CCCNC(=O)[C@@H](NC(=O)[C@@H]1CCCN1C(=O)[C@H](CC(O)=O)NC(=O)[C@@H]1CCCCN1C(=O)[C@@H](NC(=O)C[C@H](C)C1CCCCC1)[C@@H](C)O)[C@@H](C)O
InChI Key InChIKey=SQZHOYYHYFBEBT-OTLUFUGZSA-N
Data  1 IC50
  Tab Delimited (TSV)   2D SDfile   Computed 3D by Vconf -m prep SDfile
Find this compound or compounds like it in BindingDB:
Activity Spreadsheet -- Enzyme Inhibition Constant Data from BindingDB
Found 1 hit for monomerid = 50287646
TargetHLA class II histocompatibility antigen, DR beta 3 chain(Homo sapiens (Human))
TBA
Curated by ChEMBL
LigandPNGBDBM50287646((S)-3-({1-[(2S,3R)-2-((R)-3-Cyclohexyl-butyrylamin...)
Affinity DataIC50:  1.30E+3nM. Assay description: Ability to compete for binding to Class II MHC using ELISA assay.
In DepthDetails Article