BDBM50287790 (2S,4R)-1-Acetyl-4-benzyloxy-pyrrolidine-2-carboxylic acid [(S)-1-(2-chloro-acetyl)-4-guanidino-butyl]-amide::CHEMBL70668
SMILES CC(=O)N1C[C@@H](C[C@H]1C(=O)N[C@@H](CCCNC(N)=N)C(=O)CCl)OCc1ccccc1
InChI Key InChIKey=ZCLKPUGNAWCVGJ-SQNIBIBYSA-N
Data  1 IC50
  Tab Delimited (TSV)   2D SDfile   Computed 3D by Vconf -m prep SDfile
Find this compound or compounds like it in BindingDB:
Activity Spreadsheet -- Enzyme Inhibition Constant Data from BindingDB
Found 1 hit for monomerid = 50287790
TargetProthrombin(Homo sapiens (Human))
TBA
Curated by ChEMBL
LigandPNGBDBM50287790((2S,4R)-1-Acetyl-4-benzyloxy-pyrrolidine-2-carboxy...)
Affinity DataIC50:  0.900nM. Assay description: Inhibition of thrombin
In DepthDetails Article