BDBM50287817 (S)-1-Methyl-2-(2-trifluoromethyl-phenoxymethyl)-pyrrolidine::CHEMBL73276
SMILES CN1CCC[C@H]1COc1ccccc1C(F)(F)F
InChI Key InChIKey=PENZVEJSWQNPQI-JTQLQIEISA-N
Data  1 KI
  Tab Delimited (TSV)   2D SDfile   Computed 3D by Vconf -m prep SDfile
Find this compound or compounds like it in BindingDB:
Activity Spreadsheet -- Enzyme Inhibition Constant Data from BindingDB
Found 1 hit for monomerid = 50287817
TargetNeuronal acetylcholine receptor subunit alpha-10(Rattus norvegicus)
TBA
Curated by ChEMBL
LigandPNGBDBM50287817((S)-1-Methyl-2-(2-trifluoromethyl-phenoxymethyl)-p...)
Affinity DataKi:  2.43E+3nM. Assay description: Binding affinity against neuronal nicotinic acetylcholine receptor(nAChR) by using [3H]-Cytisine as radioligand in whole rat brain
In DepthDetails Article