BDBM50288087 2-Ethoxy-5-methyl-benzo[d][1,3]oxazin-4-one::CHEMBL81249
SMILES CCOc1nc2cccc(C)c2c(=O)o1
InChI Key InChIKey=RXRDLQPDTPLKJM-UHFFFAOYSA-N
Data  1 KI  1 IC50  1 Koff  1 Kon
  Tab Delimited (TSV)   2D SDfile   Computed 3D by Vconf -m prep SDfile
Find this compound or compounds like it in BindingDB:
Activity Spreadsheet -- Enzyme Inhibition Constant Data from BindingDB
Found 1 hit for monomerid = 50288087
TargetNeutrophil elastase(Homo sapiens (Human))
Syntex Research
Curated by ChEMBL
LigandPNGBDBM50288087(2-Ethoxy-5-methyl-benzo[d][1,3]oxazin-4-one | CHEM...)
Affinity DataKi:  0.126nM Kon:  0.0000117M-1s-1 Koff:  1.02E+5s-1Assay Description:Component deacylation rate constant for interaction with human leukocyte elastaseChecked by Author
In DepthDetails ArticlePubMed