BDBM50290488 8-Hydroxy-5-{2-hydroxy-3-[2-(4-methoxy-phenyl)-ethylamino]-propoxy}-3,4-dihydro-1H-quinolin-2-one::CHEMBL70399
SMILES COc1ccc(CCNC[C@@H](O)COc2ccc(O)c3NC(=O)CCc23)cc1
InChI Key InChIKey=GYIIDLBOLUQESI-OAHLLOKOSA-N
Data  1 EC50
  Tab Delimited (TSV)   2D SDfile   Computed 3D by Vconf -m prep SDfile
Find this compound or compounds like it in BindingDB:
Activity Spreadsheet -- Enzyme Inhibition Constant Data from BindingDB
Found 1 hit for monomerid = 50290488
TargetBeta-3 adrenergic receptor(Homo sapiens (Human))
TBA
Curated by ChEMBL
LigandPNGBDBM50290488(8-Hydroxy-5-{2-hydroxy-3-[2-(4-methoxy-phenyl)-eth...)
Affinity DataEC50:  560nM. Assay description: Agonist efficacy for human Beta-3 adrenergic receptor expressed in chinese hamster ovary cells
In DepthDetails Article