BDBM50290494 4-{2-Hydroxy-3-[2-(4-methoxy-phenyl)-ethylamino]-propoxy}-2-hydroxymethyl-phenol::CHEMBL72706
SMILES COc1ccc(CCNC[C@@H](O)COc2ccc(O)c(CO)c2)cc1
InChI Key InChIKey=PQGPALNUBOGKQY-MRXNPFEDSA-N
Data  1 EC50
  Tab Delimited (TSV)   2D SDfile   Computed 3D by Vconf -m prep SDfile
Find this compound or compounds like it in BindingDB:
Activity Spreadsheet -- Enzyme Inhibition Constant Data from BindingDB
Found 1 hit for monomerid = 50290494
TargetBeta-3 adrenergic receptor(Homo sapiens (Human))
TBA
Curated by ChEMBL
LigandPNGBDBM50290494(4-{2-Hydroxy-3-[2-(4-methoxy-phenyl)-ethylamino]-p...)
Affinity DataEC50:  4.70E+3nM. Assay description: Agonist efficacy for human Beta-3 adrenergic receptor expressed in chinese hamster ovary cells
In DepthDetails Article