BDBM50291125 CHEMBL3856135::CHEMBL411548::Interleukin-8 inhibitor, 8
SMILES CSCC[C@H](NC(C)=O)C(=O)N[C@@H](Cc1c[nH]c2ccccc12)C(=O)N[C@@H](CC(O)=O)C(=O)N[C@@H](Cc1ccccc1)C(=O)N[C@@H](CC(O)=O)C(=O)N[C@@H](CC(O)=O)C(=O)N[C@@H](CC(C)C)C(=O)N[C@@H](CC(N)=O)C(=O)N[C@@H](Cc1ccccc1)C(=O)NCc1ccccc1C(=O)N[C@@H](CCSC)C(=O)N1CCC[C@H]1C(=O)N1CCC[C@H]1C(=O)N[C@@H](C)C(=O)N[C@@H](CC(O)=O)C(=O)N[C@@H](CCC(O)=O)C(=O)N[C@@H](CC(O)=O)C(=O)N[C@@H](Cc1ccc(O)cc1)C(=O)N[C@@H](CO)C(=O)N1CCCC1C(N)=O
InChI Key InChIKey=FTQJFKLOICWWPC-AVTWMHHVSA-N
Data  1 KI
  Tab Delimited (TSV)   2D SDfile   Computed 3D by Vconf -m prep SDfile
Find this compound or compounds like it in BindingDB:
Activity Spreadsheet -- Enzyme Inhibition Constant Data from BindingDB
Found 1 hit for monomerid = 50291125
TargetInterleukin-8(Homo sapiens (Human))
TBA
Curated by ChEMBL
LigandPNGBDBM50291125(CHEMBL3856135 | CHEMBL411548 | Interleukin-8 inhib...)
Affinity DataKi:  9.30E+3nM. Assay description: Inhibition of Interleukin-8 (IL-8)
In DepthDetails Article