BDBM50291452 CHEMBL368161::N-Methyl-N'-(6-phenethyloxy-biphenyl-3-yl)-guanidine
SMILES CNC(N)=Nc1ccc(OCCc2ccccc2)c(c1)-c1ccccc1
InChI Key InChIKey=QXDMVRPQHNFBSZ-UHFFFAOYSA-N
Data  1 IC50
  Tab Delimited (TSV)   2D SDfile   Computed 3D by Vconf -m prep SDfile
Find this compound or compounds like it in BindingDB:
Activity Spreadsheet -- Enzyme Inhibition Constant Data from BindingDB
Found 1 hit for monomerid = 50291452
TargetC5a anaphylatoxin chemotactic receptor 1(Homo sapiens (Human))
TBA
Curated by ChEMBL
LigandPNGBDBM50291452(CHEMBL368161 | N-Methyl-N'-(6-phenethyloxy-bipheny...)
Affinity DataIC50:  800nM. Assay description: Compound was evaluated for the antagonistic activity against C5a anaphylatoxin chemotactic receptor in human neutrophil C5a stimulated respiratory bu...
In DepthDetails Article