BDBM50292039 (2-{[2-(2-Sulfamoyl-benzothiazol-6-yloxy)-ethoxycarbonylmethyl]-amino}-ethylamino)-acetic acid::CHEMBL418402
SMILES NS(=O)(=O)c1nc2ccc(OCCOC(=O)CNCCNCC(O)=O)cc2s1
InChI Key InChIKey=ICVMJXJRTYOTJH-UHFFFAOYSA-N
Data  3 KI
  Tab Delimited (TSV)   2D SDfile   Computed 3D by Vconf -m prep SDfile
Find this compound or compounds like it in BindingDB:
Activity Spreadsheet -- Enzyme Inhibition Constant Data from BindingDB
Found 3 hits for monomerid = 50292039
TargetCarbonic anhydrase 2(Homo sapiens (Human))
Universit£
Curated by ChEMBL
LigandPNGBDBM50292039((2-{[2-(2-Sulfamoyl-benzothiazol-6-yloxy)-ethoxyca...)
Affinity DataKi:  4nM. Assay description: Inhibitory activity against Human carbonic anhydrase II
In DepthDetails ArticlePubMed
TargetCarbonic anhydrase 4(Bos taurus (bovine))
Universit£
Curated by ChEMBL
LigandPNGBDBM50292039((2-{[2-(2-Sulfamoyl-benzothiazol-6-yloxy)-ethoxyca...)
Affinity DataKi:  9nM. Assay description: Inhibitory activity against bovine carbonic anhydrase IV
In DepthDetails ArticlePubMed
TargetCarbonic anhydrase 1(Homo sapiens (Human))
Universit£
Curated by ChEMBL
LigandPNGBDBM50292039((2-{[2-(2-Sulfamoyl-benzothiazol-6-yloxy)-ethoxyca...)
Affinity DataKi:  43nM. Assay description: Inhibitory activity against Human carbonic anhydrase I
In DepthDetails ArticlePubMed