BDBM50292633 4'-{[2-n-propyl-4-methyl-6-(1-methylbenzoimidazol-2-yl)benzoimidazol-1-yl]methyl}-2-(1H-imidazoline-2-yl)biphenyl::CHEMBL453934
SMILES CCCc1nc2c(C)cc(cc2n1Cc1ccc(cc1)-c1ccccc1C1=NCCN1)-c1nc2ccccc2n1C
InChI Key InChIKey=GQMRFIMBKDRSJE-UHFFFAOYSA-N
Data  2 IC50
  Tab Delimited (TSV)   2D SDfile   Computed 3D by Vconf -m prep SDfile
Find this compound or compounds like it in BindingDB:
Activity Spreadsheet -- Enzyme Inhibition Constant Data from BindingDB
Found 2 hits for monomerid = 50292633
TargetType-1 angiotensin II receptor(Bos taurus)
The M. S. University Of Baroda
Curated by ChEMBL
LigandPNGBDBM50292633(4'-{[2-n-propyl-4-methyl-6-(1-methylbenzoimidazol-...)
Affinity DataIC50:  2.90nM. Assay description: Displacement of radiolabeled angiotensin 2 from angiotensin AT1 receptor in bovine adrenal cortex membranes
In DepthDetails ArticlePubMed
TargetType-1 angiotensin II receptor(Bos taurus)
The M. S. University Of Baroda
Curated by ChEMBL
LigandPNGBDBM50292633(4'-{[2-n-propyl-4-methyl-6-(1-methylbenzoimidazol-...)
Affinity DataIC50:  290nM. Assay description: Displacement of [125I]Ang2 from AT1 receptor in bovine adrenal cortex
In DepthDetails ArticlePubMed