BDBM50292754 17beta-Hydroxy-11beta-[4-(N-methylhexylamino)-phenyl]-17alpha-(1-propinyl)-estra-4,9-dien-3-one::CHEMBL493845
SMILES CCCCCCN(C)c1ccc(cc1)[C@H]1C[C@@]2(C)[C@@H](CC[C@@]2(O)C#CC)[C@@H]2CCC3=CC(=O)CCC3=C12
InChI Key InChIKey=UHRDSPGREWBOFB-FMHBTXFXSA-N
Data  2 IC50
  Tab Delimited (TSV)   2D SDfile   Computed 3D by Vconf -m prep SDfile
Find this compound or compounds like it in BindingDB:
Activity Spreadsheet -- Enzyme Inhibition Constant Data from BindingDB
Found 2 hits for monomerid = 50292754
TargetProgesterone receptor(Homo sapiens (Human))
University Of Graz
Curated by ChEMBL
LigandPNGBDBM50292754(17beta-Hydroxy-11beta-[4-(N-methylhexylamino)-phen...)
Affinity DataIC50:  0.660nM. Assay description: Antagonist activity at progesterone receptor in human T47D cells assessed as inhibition of progesterone-induced alkaline phosphatase activity after 4...
In DepthDetails ArticlePubMed
TargetProgesterone receptor(Homo sapiens (Human))
University Of Graz
Curated by ChEMBL
LigandPNGBDBM50292754(17beta-Hydroxy-11beta-[4-(N-methylhexylamino)-phen...)
Affinity DataIC50:  0.180nM. Assay description: Antagonist activity at progesterone receptor in human T47D-C124 cells transfected with luciferase gene linked to MMTV promoter assessed as inhibition...
In DepthDetails ArticlePubMed