BDBM50293047 (R)-N2-(4-Chlorobenzyl)-N1-(4-fluorophenyl)-N2-methylpyrrolidine-1,2-dicarboxamide::CHEMBL516495
SMILES CN(Cc1ccc(Cl)cc1)C(=O)[C@H]1CCCN1C(=O)Nc1ccc(F)cc1
InChI Key InChIKey=JGPSKQYQDKIFGV-GOSISDBHSA-N
Data  1 IC50
  Tab Delimited (TSV)   2D SDfile   Computed 3D by Vconf -m prep SDfile
Find this compound or compounds like it in BindingDB:
Activity Spreadsheet -- Enzyme Inhibition Constant Data from BindingDB
Found 1 hit for monomerid = 50293047
TargetC-C chemokine receptor type 1(Homo sapiens (Human))
Pharmacopeia
Curated by ChEMBL
LigandPNGBDBM50293047((R)-N2-(4-Chlorobenzyl)-N1-(4-fluorophenyl)-N2-met...)
Affinity DataIC50:  700nM. Assay description: Displacement of [125I]MIP-1alpha from human recombinant CCR1 expressed in HEK293 cells
In DepthDetails ArticlePubMed