BDBM50293166 CHEMBL495545::N-(4-(4-methylpiperazin-1-yl)phenyl)-4-(pyrazolo[1,5-b]pyridazin-3-yl)pyrimidin-2-amine
SMILES CN1CCN(CC1)c1ccc(Nc2nccc(n2)-c2cnn3ncccc23)cc1
InChI Key InChIKey=AUAUBVTWWCYNPP-UHFFFAOYSA-N
Data  4 IC50
  Tab Delimited (TSV)   2D SDfile   Computed 3D by Vconf -m prep SDfile
Find this compound or compounds like it in BindingDB:
Activity Spreadsheet -- Enzyme Inhibition Constant Data from BindingDB
Found 4 hits for monomerid = 50293166
TargetVascular endothelial growth factor receptor 2(Homo sapiens (Human))
Glaxosmithkline
Curated by ChEMBL
LigandPNGBDBM50293166(CHEMBL495545 | N-(4-(4-methylpiperazin-1-yl)phenyl...)
Affinity DataIC50:  400nM. Assay description: Inhibition of VEGFR2 by HTRF assay
In DepthDetails ArticlePubMed
TargetCyclin-dependent kinase 4(Homo sapiens (Human))
Glaxosmithkline
Curated by ChEMBL
LigandPNGBDBM50293166(CHEMBL495545 | N-(4-(4-methylpiperazin-1-yl)phenyl...)
Affinity DataIC50:  12nM. Assay description: Inhibition of CDK4 by radioactive glutathione plate-binding assay
In DepthDetails ArticlePubMed
TargetCyclin-dependent kinase 2(Homo sapiens (Human))
Glaxosmithkline
Curated by ChEMBL
LigandPNGBDBM50293166(CHEMBL495545 | N-(4-(4-methylpiperazin-1-yl)phenyl...)
Affinity DataIC50:  100nM. Assay description: Inhibition of human CDK2 by HTRF assay
In DepthDetails ArticlePubMed
TargetGlycogen synthase kinase-3 beta(Homo sapiens (Human))
Glaxosmithkline
Curated by ChEMBL
LigandPNGBDBM50293166(CHEMBL495545 | N-(4-(4-methylpiperazin-1-yl)phenyl...)
Affinity DataIC50:  200nM. Assay description: Inhibition of GSK3beta by scintillation proximity assay
In DepthDetails ArticlePubMed