BDBM50293415 (S)-4'-(2-{[2-Hydroxy-3-(4-hydroxyphenoxy)propyl]amino}ethyl)-2-hydroxy-2-phenylacetanilide::CHEMBL551832
SMILES O[C@@H](CNCCc1ccc(NC(=O)C(O)c2ccccc2)cc1)COc1ccc(O)cc1
InChI Key InChIKey=JRGYLOCJPAITNI-OWJIYDKWSA-N
Data  3 EC50
  Tab Delimited (TSV)   2D SDfile   Computed 3D by Vconf -m prep SDfile
Find this compound or compounds like it in BindingDB:
Activity Spreadsheet -- Enzyme Inhibition Constant Data from BindingDB
Found 3 hits for monomerid = 50293415
TargetBeta-2 adrenergic receptor(Homo sapiens (Human))
Astellas Pharma
Curated by ChEMBL
LigandPNGBDBM50293415((S)-4'-(2-{[2-Hydroxy-3-(4-hydroxyphenoxy)propyl]a...)
Affinity DataEC50: >1.00E+5nM. Assay description: Agonist activity at human cloned adrenergic beta2 receptor expressed in CHO cells assessed as increase in cAMP production after 2 days by radioimmuno...
In DepthDetails ArticlePubMed
TargetBeta-3 adrenergic receptor(Homo sapiens (Human))
Astellas Pharma
Curated by ChEMBL
LigandPNGBDBM50293415((S)-4'-(2-{[2-Hydroxy-3-(4-hydroxyphenoxy)propyl]a...)
Affinity DataEC50:  960nM. Assay description: Agonist activity at human cloned adrenergic beta3 receptor expressed in CHO cells assessed as increase in cAMP production after 2 days by radioimmuno...
In DepthDetails ArticlePubMed
TargetBeta-1 adrenergic receptor(Homo sapiens (Human))
Astellas Pharma
Curated by ChEMBL
LigandPNGBDBM50293415((S)-4'-(2-{[2-Hydroxy-3-(4-hydroxyphenoxy)propyl]a...)
Affinity DataEC50:  590nM. Assay description: Agonist activity at human cloned adrenergic beta-1 receptor expressed in CHO cells assessed as increase in cAMP production after 2 days by radioimmun...
In DepthDetails ArticlePubMed