BDBM50294161 (R)-4-(2-((4-(4-chlorophenoxy)phenoxy)methyl)pyrrolidin-1-yl)butanoic acid::4-{(R)-2-(4-(4-Chlorophenoxy)phenoxymethyl)pyrrolidin-1-yl}-l-butyric Acid::CHEMBL563693
SMILES OC(=O)CCCN1CCC[C@@H]1COc1ccc(Oc2ccc(Cl)cc2)cc1
InChI Key InChIKey=PVCTYSQBVIGZRU-QGZVFWFLSA-N
Data  3 IC50
  Tab Delimited (TSV)   2D SDfile   Computed 3D by Vconf -m prep SDfile
Find this compound or compounds like it in BindingDB:
Activity Spreadsheet -- Enzyme Inhibition Constant Data from BindingDB
Found 3 hits for monomerid = 50294161
TargetLeukotriene A-4 hydrolase(Homo sapiens (Human))
Decode Biostructures
Curated by ChEMBL
LigandPNGBDBM50294161((R)-4-(2-((4-(4-chlorophenoxy)phenoxy)methyl)pyrro...)
Affinity DataIC50:  69nM. Assay description: Inhibition of peptidase activity of human recombinant LTA4H expressed in Escherichia coli BL21-AI/pRARE
In DepthDetails ArticlePubMed
TargetLeukotriene A-4 hydrolase(Homo sapiens (Human))
Decode Biostructures
Curated by ChEMBL
LigandPNGBDBM50294161((R)-4-(2-((4-(4-chlorophenoxy)phenoxy)methyl)pyrro...)
Affinity DataIC50:  33nM. Assay description: Inhibition of human LTA4H hydrolysis assessed as inhibition of Ca2+ ionophore-stimulated LTB4 formation in human whole blood by ELISAChecked by Author
In DepthDetails ArticlePubMed
TargetLeukotriene A-4 hydrolase(Homo sapiens (Human))
Decode Biostructures
Curated by ChEMBL
LigandPNGBDBM50294161((R)-4-(2-((4-(4-chlorophenoxy)phenoxy)methyl)pyrro...)
Affinity DataIC50:  71nM. Assay description: Inhibition of hydrolase activity of human recombinant LTA4H expressed in Escherichia coli BL21-AI/pRARE assessed as LTB4 formation by tandem quadrupo...
In DepthDetails ArticlePubMed