BDBM50294748 3-Benzyl-8-chloro-4-(3-{[2-chloro-5-(trifluoromethyl)-benzyl]oxy}phenyl)cinnoline::CHEMBL554698
SMILES FC(F)(F)c1ccc(Cl)c(COc2cccc(c2)-c2c(Cc3ccccc3)nnc3c(Cl)cccc23)c1
InChI Key InChIKey=NZQXAMQFVOUGNZ-UHFFFAOYSA-N
Data  2 IC50
  Tab Delimited (TSV)   2D SDfile   Computed 3D by Vconf -m prep SDfile
Find this compound or compounds like it in BindingDB:
Activity Spreadsheet -- Enzyme Inhibition Constant Data from BindingDB
Found 2 hits for monomerid = 50294748
TargetOxysterols receptor LXR-alpha(Homo sapiens (Human))
Wyeth Research
Curated by ChEMBL
LigandPNGBDBM50294748(3-Benzyl-8-chloro-4-(3-{[2-chloro-5-(trifluorometh...)
Affinity DataIC50:  1.47E+5nM. Assay description: Agonist activity at human LXRalpha ligand binding domain (205-448) expressed in human HuH7 cells co-transfected with Gal4-DBD by luciferase transacti...
In DepthDetails ArticlePubMed
TargetOxysterols receptor LXR-beta(Homo sapiens (Human))
Wyeth Research
Curated by ChEMBL
LigandPNGBDBM50294748(3-Benzyl-8-chloro-4-(3-{[2-chloro-5-(trifluorometh...)
Affinity DataIC50:  1.20E+4nM. Assay description: Displacement of [3H]T0901317 from human recombinant N-terminal biotinylated tagged LXRbeta ligand binding domain (154-461) expressed in Escherichia c...
In DepthDetails ArticlePubMed