BDBM50295156 5-(2-Amino-phenyl)-[1,3,4]oxadiazole-2-carboxylic acid cyclohexylamide::CHEMBL564809
SMILES Nc1ccccc1-c1nnc(o1)C(=O)NC1CCCCC1
InChI Key InChIKey=DAWXVAIHGJMRRA-UHFFFAOYSA-N
Data  1 IC50
  Tab Delimited (TSV)   2D SDfile   Computed 3D by Vconf -m prep SDfile
Find this compound or compounds like it in BindingDB:
Activity Spreadsheet -- Enzyme Inhibition Constant Data from BindingDB
Found 1 hit for monomerid = 50295156
TargetCruzipain(Trypanosoma cruzi)
University Of California
Curated by ChEMBL
LigandPNGBDBM50295156(5-(2-Amino-phenyl)-[1,3,4]oxadiazole-2-carboxylic ...)
Affinity DataIC50:  2.50E+4nM. Assay description: Inhibition of Trypanosoma cruzi cruzain preincubated for 5 mins before substrate addition
In DepthDetails ArticlePubMed