BDBM50297855 CHEMBL559061::N1-(1-(1-(4-fluorobenzyl)-1H-benzo[d]imidazol-2-yl)piperidin-4-yl)-N1,N2,N2-trimethylethane-1,2-diamine
SMILES CN(C)CCN(C)C1CCN(CC1)c1nc2ccccc2n1Cc1ccc(F)cc1
InChI Key InChIKey=SULKMHQPINMVTR-UHFFFAOYSA-N
Data  2 KI  2 IC50
  Tab Delimited (TSV)   2D SDfile   Computed 3D by Vconf -m prep SDfile
Find this compound or compounds like it in BindingDB:
Activity Spreadsheet -- Enzyme Inhibition Constant Data from BindingDB
Found 4 hits for monomerid = 50297855
TargetHistamine H1 receptor(Homo sapiens (Human))
Neurocrine Biosciences
Curated by ChEMBL
LigandPNGBDBM50297855(CHEMBL559061 | N1-(1-(1-(4-fluorobenzyl)-1H-benzo[...)
Affinity DataKi:  2.90nM. Assay description: Displacement of [3H]pyrilamine from human histamine H1 receptor expressed in CHO Flp-In cells by liquid scintillation assay
In DepthDetails ArticlePubMed
TargetPotassium voltage-gated channel subfamily H member 2(Homo sapiens (Human))
Neurocrine Biosciences
Curated by ChEMBL
LigandPNGBDBM50297855(CHEMBL559061 | N1-(1-(1-(4-fluorobenzyl)-1H-benzo[...)
Affinity DataKi:  776nM. Assay description: Displacement of [3H]dofetolide from human ERG channel expressed in HEK293 cells at 37 degC by liquid scintillation assay
In DepthDetails ArticlePubMed
TargetCytochrome P450 2D6(Homo sapiens (Human))
Neurocrine Biosciences
Curated by ChEMBL
LigandPNGBDBM50297855(CHEMBL559061 | N1-(1-(1-(4-fluorobenzyl)-1H-benzo[...)
Affinity DataIC50:  6.13E+3nM. Assay description: Inhibition of CYP2D6
In DepthDetails ArticlePubMed
TargetCytochrome P450 3A4(Homo sapiens (Human))
Neurocrine Biosciences
Curated by ChEMBL
LigandPNGBDBM50297855(CHEMBL559061 | N1-(1-(1-(4-fluorobenzyl)-1H-benzo[...)
Affinity DataIC50: >5.00E+3nM. Assay description: Inhibition of CYP3A4
In DepthDetails ArticlePubMed