BDBM50297856 1-(1-(4-methoxybenzyl)-1H-benzo[d]imidazol-2-yl)-N-((tetrahydro-2H-pyran-4-yl)methyl)piperidin-4-amine::CHEMBL563055
SMILES COc1ccc(Cn2c(nc3ccccc23)N2CCC(CC2)NCC2CCOCC2)cc1
InChI Key InChIKey=NMEALLMQARPNTN-UHFFFAOYSA-N
Data  2 KI  2 IC50
  Tab Delimited (TSV)   2D SDfile   Computed 3D by Vconf -m prep SDfile
Find this compound or compounds like it in BindingDB:
Activity Spreadsheet -- Enzyme Inhibition Constant Data from BindingDB
Found 4 hits for monomerid = 50297856
TargetHistamine H1 receptor(Homo sapiens (Human))
Neurocrine Biosciences
Curated by ChEMBL
LigandPNGBDBM50297856(1-(1-(4-methoxybenzyl)-1H-benzo[d]imidazol-2-yl)-N...)
Affinity DataKi:  14.1nM. Assay description: Displacement of [3H]pyrilamine from human histamine H1 receptor expressed in CHO Flp-In cells by liquid scintillation assay
In DepthDetails ArticlePubMed
TargetPotassium voltage-gated channel subfamily H member 2(Homo sapiens (Human))
Neurocrine Biosciences
Curated by ChEMBL
LigandPNGBDBM50297856(1-(1-(4-methoxybenzyl)-1H-benzo[d]imidazol-2-yl)-N...)
Affinity DataKi:  1.46E+3nM. Assay description: Displacement of [3H]dofetolide from human ERG channel expressed in HEK293 cells at 37 degC by liquid scintillation assay
In DepthDetails ArticlePubMed
TargetCytochrome P450 2D6(Homo sapiens (Human))
Neurocrine Biosciences
Curated by ChEMBL
LigandPNGBDBM50297856(1-(1-(4-methoxybenzyl)-1H-benzo[d]imidazol-2-yl)-N...)
Affinity DataIC50:  1.63E+4nM. Assay description: Inhibition of CYP2D6
In DepthDetails ArticlePubMed
TargetCytochrome P450 3A4(Homo sapiens (Human))
Neurocrine Biosciences
Curated by ChEMBL
LigandPNGBDBM50297856(1-(1-(4-methoxybenzyl)-1H-benzo[d]imidazol-2-yl)-N...)
Affinity DataIC50: >5.00E+3nM. Assay description: Inhibition of CYP3A4
In DepthDetails ArticlePubMed