BDBM50297866 1-(1-(4-fluorobenzyl)-1H-benzo[d]imidazol-2-yl)-N-methylpiperidin-4-amine::CHEMBL549599
SMILES CNC1CCN(CC1)c1nc2ccccc2n1Cc1ccc(F)cc1
InChI Key InChIKey=LDMXQNXCFMLIER-UHFFFAOYSA-N
Data  3 KI
  Tab Delimited (TSV)   2D SDfile   Computed 3D by Vconf -m prep SDfile
Find this compound or compounds like it in BindingDB:
Activity Spreadsheet -- Enzyme Inhibition Constant Data from BindingDB
Found 3 hits for monomerid = 50297866
TargetHistamine H1 receptor(Homo sapiens (Human))
Neurocrine Biosciences
Curated by ChEMBL
LigandPNGBDBM50297866(1-(1-(4-fluorobenzyl)-1H-benzo[d]imidazol-2-yl)-N-...)
Affinity DataKi:  2.40nM. Assay description: Displacement of [3H]pyrilamine from human histamine H1 receptor expressed in CHO Flp-In cells by liquid scintillation assay
In DepthDetails ArticlePubMed
TargetMuscarinic acetylcholine receptor M1(Homo sapiens (Human))
Neurocrine Biosciences
Curated by ChEMBL
LigandPNGBDBM50297866(1-(1-(4-fluorobenzyl)-1H-benzo[d]imidazol-2-yl)-N-...)
Affinity DataKi:  988nM. Assay description: Displacement of [3H]N-methyl scopolamine from human muscarinic M1 receptor expressed in CHO Flp-In cells by liquid scintillation assay
In DepthDetails ArticlePubMed
TargetCytochrome P450 2D6(Homo sapiens (Human))
Neurocrine Biosciences
Curated by ChEMBL
LigandPNGBDBM50297866(1-(1-(4-fluorobenzyl)-1H-benzo[d]imidazol-2-yl)-N-...)
Affinity DataKi:  6.66E+3nM. Assay description: Inhibition of CYP2D6
In DepthDetails ArticlePubMed