BDBM50298245 4-Benzoylbenzylphosphonic((2E,6E)-3,7,11-trimethyl dodeca-2,6,10-trienyl phosphoric)anhydride::CHEMBL575827
SMILES [#6]\[#6](-[#6])=[#6]\[#6]-[#6]\[#6](-[#6])=[#6]\[#6]-[#6]\[#6](-[#6])=[#6]\[#6]-[#8]P([#8])(=O)[#8]P([#8])(=O)[#6]-c1ccc(cc1)-[#6](=O)-c1ccccc1
InChI Key InChIKey=DVXZQRARGSIGRL-NKWSUHGFSA-N
Data  1 KI  1 IC50
  Tab Delimited (TSV)   2D SDfile   Computed 3D by Vconf -m prep SDfile
Find this compound or compounds like it in BindingDB:
Activity Spreadsheet -- Enzyme Inhibition Constant Data from BindingDB
Found 1 hit for monomerid = 50298245
TargetProtein farnesyltransferase/geranylgeranyltransferase type-1 subunit alpha(Saccharomyces cerevisiae)
University Of Minnesota
Curated by ChEMBL
LigandPNGBDBM50298245(4-Benzoylbenzylphosphonic((2E,6E)-3,7,11-trimethyl...)
Affinity DataIC50:  3.00E+3nM. Assay description: Inhibition of Saccharomyces cerevisiae protein farnesyltransferase assessed as farnsylation of N-dansyl-GCVIA
In DepthDetails ArticlePubMed