BDBM50298716 CHEMBL574792::benzyl(2S,5S,8S,11S,14S)-8-(4-aminobutyl)-14-formyl-1-hydroxy-11-(4-hydroxybenzyl)-5-(hydroxymethyl)-16-methyl-3,6,9,12-tetraoxo-4,7,10,13-tetraazaheptadecan-2-ylcarbamate
SMILES CC(C)C[C@H](NC(=O)[C@H](Cc1ccc(O)cc1)NC(=O)[C@H](CCCCN)NC(=O)[C@H](CO)NC(=O)[C@H](CO)NC(=O)OCc1ccccc1)C=O
InChI Key InChIKey=IXQCZIVLSOBMOY-BJNPORTCSA-N
Data  1 KI
  Tab Delimited (TSV)   2D SDfile   Computed 3D by Vconf -m prep SDfile
Find this compound or compounds like it in BindingDB:
Activity Spreadsheet -- Enzyme Inhibition Constant Data from BindingDB
Found 1 hit for monomerid = 50298716
TargetProstate-specific antigen(Homo sapiens (Human))
The Johns Hopkins University School Of Medicine
Curated by ChEMBL
LigandPNGBDBM50298716(CHEMBL574792 | benzyl(2S,5S,8S,11S,14S)-8-(4-amino...)
Affinity DataKi:  13.1nM. Assay description: Inhibition of prostate-specific antigen assessed as substrate hydrolysis by fluorescence assay
In DepthDetails ArticlePubMed