BDBM50298971 (1R*,4S*,6R*)-(+/-)-2-(Butylsulfonyl)-N-[4-(propan-2-yloxy)phenyl]-2-azabicyclo[2.2.2]octane-6-carboxamide::CHEMBL572605
SMILES CCCCS(=O)(=O)N1C[C@H]2CC[C@H]1[C@@H](C2)C(=O)Nc1ccc(OC(C)C)cc1
InChI Key InChIKey=UYKMJJNZWQGCII-DBVUQKKJSA-N
Data  1 IC50
  Tab Delimited (TSV)   2D SDfile   Computed 3D by Vconf -m prep SDfile
Find this compound or compounds like it in BindingDB:
Activity Spreadsheet -- Enzyme Inhibition Constant Data from BindingDB
Found 1 hit for monomerid = 50298971
TargetElongation of very long chain fatty acids protein 6(Homo sapiens (Human))
Tsukuba Research Institute
Curated by ChEMBL
LigandPNGBDBM50298971((1R*,4S*,6R*)-(+/-)-2-(Butylsulfonyl)-N-[4-(propan...)
Affinity DataIC50:  120nM. Assay description: Inhibition of C-terminal V5-epitope-tagged human ELOVL6 expressed in african green monkey COS7 cells
In DepthDetails ArticlePubMed