BDBM50298985 (1R*,4S*,6R*)-(+/-)-2-(Phenylsulfonyl)-N-[4-(propan-2-yloxy)phenyl]-2-azabicyclo[2.2.2]octane-6-carboxamide::CHEMBL573551
SMILES CC(C)Oc1ccc(NC(=O)[C@@H]2C[C@@H]3CC[C@@H]2N(C3)S(=O)(=O)c2ccccc2)cc1
InChI Key InChIKey=CIOYCGQMPDASGF-WTOYTKOKSA-N
Data  1 IC50
  Tab Delimited (TSV)   2D SDfile   Computed 3D by Vconf -m prep SDfile
Find this compound or compounds like it in BindingDB:
Activity Spreadsheet -- Enzyme Inhibition Constant Data from BindingDB
Found 1 hit for monomerid = 50298985
TargetElongation of very long chain fatty acids protein 6(Homo sapiens (Human))
Tsukuba Research Institute
Curated by ChEMBL
LigandPNGBDBM50298985((1R*,4S*,6R*)-(+/-)-2-(Phenylsulfonyl)-N-[4-(propa...)
Affinity DataIC50:  70nM. Assay description: Inhibition of C-terminal V5-epitope-tagged human ELOVL6 expressed in african green monkey COS7 cells
In DepthDetails ArticlePubMed