BDBM50299463 5-[1,2]Dithiolan-3-yl-pentanoic acid [6-(4-{6-[ethyl-(2-methoxy-benzyl)-amino]-hexylamino}-3,6-dioxo-cyclohexa-1,4-dienylamino)-hexyl]-amide::CHEMBL572480
SMILES CCN(CCCCCC=Nc1cc(O)c(NCCCCCCNC(=O)CCCCC2CCSS2)cc1O)Cc1ccccc1OC
InChI Key InChIKey=DRWTVWGCVUJWCC-UHFFFAOYSA-N
Data  2 IC50
  Tab Delimited (TSV)   2D SDfile   Computed 3D by Vconf -m prep SDfile
Find this compound or compounds like it in BindingDB:
Activity Spreadsheet -- Enzyme Inhibition Constant Data from BindingDB
Found 2 hits for monomerid = 50299463
TargetCholinesterase(Homo sapiens (Human))
University Of Bologna
Curated by ChEMBL
LigandPNGBDBM50299463(5-[1,2]Dithiolan-3-yl-pentanoic acid [6-(4-{6-[eth...)
Affinity DataIC50:  4.99E+3nM. Assay description: Inhibition of human recombinant BChE by Ellman's method
In DepthDetails ArticlePubMed
TargetAcetylcholinesterase(Homo sapiens (Human))
University Of Bologna
Curated by ChEMBL
LigandPNGBDBM50299463(5-[1,2]Dithiolan-3-yl-pentanoic acid [6-(4-{6-[eth...)
Affinity DataIC50:  100nM. Assay description: Inhibition of human recombinant AChE by Ellman's method
In DepthDetails ArticlePubMed