BDBM50299464 5-[1,2]Dithiolan-3-yl-pentanoic acid [3-(4-{6-[ethyl-(2-methoxy-benzyl)-amino]-hexylamino}-3,6-dioxo-cyclohexa-1,4-dienylamino)-propyl]-amide::CHEMBL572532
SMILES CCN(CCCCCC=Nc1cc(O)c(NCCCNC(=O)CCCCC2CCSS2)cc1O)Cc1ccccc1OC
InChI Key InChIKey=MMTJBGZQEXUURN-UHFFFAOYSA-N
Data  2 IC50
  Tab Delimited (TSV)   2D SDfile   Computed 3D by Vconf -m prep SDfile
Find this compound or compounds like it in BindingDB:
Activity Spreadsheet -- Enzyme Inhibition Constant Data from BindingDB
Found 2 hits for monomerid = 50299464
TargetCholinesterase(Homo sapiens (Human))
University Of Bologna
Curated by ChEMBL
LigandPNGBDBM50299464(5-[1,2]Dithiolan-3-yl-pentanoic acid [3-(4-{6-[eth...)
Affinity DataIC50:  2.10E+4nM. Assay description: Inhibition of human recombinant BChE by Ellman's method
In DepthDetails ArticlePubMed
TargetAcetylcholinesterase(Homo sapiens (Human))
University Of Bologna
Curated by ChEMBL
LigandPNGBDBM50299464(5-[1,2]Dithiolan-3-yl-pentanoic acid [3-(4-{6-[eth...)
Affinity DataIC50:  150nM. Assay description: Inhibition of human recombinant AChE by Ellman's method
In DepthDetails ArticlePubMed