BDBM50299478 CHEMBL577069::Tert-Butyl 2-amino-4-methyl-5-phenylthiophene-3-carboxylate
SMILES Cc1c(sc(N)c1C(=O)OC(C)(C)C)-c1ccccc1
InChI Key InChIKey=RUHLAOLIEGUBKZ-UHFFFAOYSA-N
Data  1 IC50
  Tab Delimited (TSV)   2D SDfile   Computed 3D by Vconf -m prep SDfile
Find this compound or compounds like it in BindingDB:
Activity Spreadsheet -- Enzyme Inhibition Constant Data from BindingDB
Found 1 hit for monomerid = 50299478
TargetMetabotropic glutamate receptor 6(Homo sapiens (Human))
Universit£T Leipzig
Curated by ChEMBL
LigandPNGBDBM50299478(CHEMBL577069 | Tert-Butyl 2-amino-4-methyl-5-pheny...)
Affinity DataIC50:  3.60E+3nM. Assay description: Antagonist activity at human recombinant GluR6 expressed in HEK cells coexpressing aequorine assessed as inhibition of glutamate-induced Ca2+ influx ...
In DepthDetails ArticlePubMed