BDBM50299479 2-Amino-4-methyl-5-phenylthiophene-3-carbonitrile::CHEMBL565502
SMILES Cc1c(C#N)c(N)sc1-c1ccccc1
InChI Key InChIKey=ALTJGNDYZQYJSC-UHFFFAOYSA-N
Data  1 IC50
  Tab Delimited (TSV)   2D SDfile   Computed 3D by Vconf -m prep SDfile
Find this compound or compounds like it in BindingDB:
Activity Spreadsheet -- Enzyme Inhibition Constant Data from BindingDB
Found 1 hit for monomerid = 50299479
TargetMetabotropic glutamate receptor 6(Homo sapiens (Human))
Universit£T Leipzig
Curated by ChEMBL
LigandPNGBDBM50299479(2-Amino-4-methyl-5-phenylthiophene-3-carbonitrile ...)
Affinity DataIC50:  7.10E+4nM. Assay description: Antagonist activity at human recombinant GluR6 expressed in HEK cells coexpressing aequorine assessed as inhibition of glutamate-induced Ca2+ influx ...
In DepthDetails ArticlePubMed