BDBM50302794 4-(5-(quinuclidin-3-yl)pyridin-2-yl)morpholine::CHEMBL570620
SMILES C1CN(CCO1)c1ccc(cn1)C1CN2CCC1CC2
InChI Key InChIKey=XQCIUXBVISSCDG-UHFFFAOYSA-N
Data  1 KI
  Tab Delimited (TSV)   2D SDfile   Computed 3D by Vconf -m prep SDfile
Find this compound or compounds like it in BindingDB:
Activity Spreadsheet -- Enzyme Inhibition Constant Data from BindingDB
Found 1 hit for monomerid = 50302794
TargetNeuronal acetylcholine receptor subunit alpha-7(Rattus norvegicus (Rat))
Universit£
Curated by ChEMBL
LigandPNGBDBM50302794(4-(5-(quinuclidin-3-yl)pyridin-2-yl)morpholine | C...)
Affinity DataKi:  350nM. Assay description: Displacement of [125I]alpha-bungarotoxin from rat alpha7 nAChR
In DepthDetails ArticlePubMed