BDBM50302998 6-(3,5-dimethylisoxazol-4-yl)-N-(3-fluorobenzyl)quinazolin-4-amine::CHEMBL566293
SMILES Cc1noc(C)c1-c1ccc2ncnc(NCc3cccc(F)c3)c2c1
InChI Key InChIKey=BPBAVYLFZPTYRL-UHFFFAOYSA-N
Data  1 IC50
  Tab Delimited (TSV)   2D SDfile   Computed 3D by Vconf -m prep SDfile
Find this compound or compounds like it in BindingDB:
Activity Spreadsheet -- Enzyme Inhibition Constant Data from BindingDB
Found 1 hit for monomerid = 50302998
TargetDual specificity protein kinase CLK4(Homo sapiens (Human))
National Human Genome Research Institute
Curated by ChEMBL
LigandPNGBDBM50302998(6-(3,5-dimethylisoxazol-4-yl)-N-(3-fluorobenzyl)qu...)
Affinity DataIC50:  178nM. Assay description: Inhibition of Clk4
In DepthDetails ArticlePubMed