BDBM50302999 6-(3,5-dimethylisoxazol-4-yl)-N-((4-methylthiophen-2-yl)methyl)quinazolin-4-amine::CHEMBL583200
SMILES Cc1csc(CNc2ncnc3ccc(cc23)-c2c(C)noc2C)c1
InChI Key InChIKey=OAZQUTMJTTUDBQ-UHFFFAOYSA-N
Data  1 IC50
  Tab Delimited (TSV)   2D SDfile   Computed 3D by Vconf -m prep SDfile
Find this compound or compounds like it in BindingDB:
Activity Spreadsheet -- Enzyme Inhibition Constant Data from BindingDB
Found 1 hit for monomerid = 50302999
TargetDual specificity protein kinase CLK4(Homo sapiens (Human))
National Human Genome Research Institute
Curated by ChEMBL
LigandPNGBDBM50302999(6-(3,5-dimethylisoxazol-4-yl)-N-((4-methylthiophen...)
Affinity DataIC50:  501nM. Assay description: Inhibition of Clk4
In DepthDetails ArticlePubMed