BDBM50303061 3-(6-(ethyl(pyridin-4-ylmethyl)amino)pyrimidin-4-yl)pyrazolo[1,5-a]pyrimidin-2-amine::CHEMBL569739
SMILES CCN(Cc1ccncc1)c1cc(ncn1)-c1c(N)nn2cccnc12
InChI Key InChIKey=XTSLTQZNZBRQCY-UHFFFAOYSA-N
Data  2 IC50
  Tab Delimited (TSV)   2D SDfile   Computed 3D by Vconf -m prep SDfile
Find this compound or compounds like it in BindingDB:
Activity Spreadsheet -- Enzyme Inhibition Constant Data from BindingDB
Found 2 hits for monomerid = 50303061
TargetTyrosine-protein kinase JAK3(Homo sapiens (Human))
Vertex Pharmaceuticals
Curated by ChEMBL
LigandPNGBDBM50303061(3-(6-(ethyl(pyridin-4-ylmethyl)amino)pyrimidin-4-y...)
Affinity DataIC50:  4.40E+3nM. Assay description: Inhibition of JAK3 by radiometric assay
In DepthDetails ArticlePubMed
TargetTyrosine-protein kinase JAK2(Homo sapiens (Human))
Vertex Pharmaceuticals
Curated by ChEMBL
LigandPNGBDBM50303061(3-(6-(ethyl(pyridin-4-ylmethyl)amino)pyrimidin-4-y...)
Affinity DataIC50:  560nM. Assay description: Inhibition of JAK2 by radiometric assay
In DepthDetails ArticlePubMed