BDBM50303728 2-amino-4-(3-chlorophenyl)-1-methyl-4-phenyl-1H-imidazol-5(4H)-one::CHEMBL578410
SMILES CN1C(N)=NC(C1=O)(c1ccccc1)c1cccc(Cl)c1
InChI Key InChIKey=QWEOCJPATDOXQJ-UHFFFAOYSA-N
Data  1 KI  4 IC50  1 EC50
  Tab Delimited (TSV)   2D SDfile   Computed 3D by Vconf -m prep SDfile
Find this compound or compounds like it in BindingDB:
Activity Spreadsheet -- Enzyme Inhibition Constant Data from BindingDB
Found 6 hits for monomerid = 50303728
TargetBeta-secretase 1(Homo sapiens (Human))
Merck Research Laboratories
Curated by ChEMBL
LigandPNGBDBM50303728(2-amino-4-(3-chlorophenyl)-1-methyl-4-phenyl-1H-im...)
Affinity DataKi:  300nM. Assay description: Inhibition of human BACE1 using QSY7EISEVNLDAEFC-Eu-amide as substrate incubated for 30 mins prior to substrate addition measured after 90 mins by FR...
In DepthDetails ArticlePubMed
TargetBeta-secretase 1(Homo sapiens (Human))
Merck Research Laboratories
Curated by ChEMBL
LigandPNGBDBM50303728(2-amino-4-(3-chlorophenyl)-1-methyl-4-phenyl-1H-im...)
Affinity DataEC50:  6.97E+3nM. Assay description: Inhibition of BACE1 expressed in CHOK1 cells coexpressing human recombinant wild type APP assessed as blockade of amyloid beta production by ELISA
In DepthDetails ArticlePubMed
TargetCathepsin D(Homo sapiens (Human))
Wyeth Research
Curated by ChEMBL
LigandPNGBDBM50303728(2-amino-4-(3-chlorophenyl)-1-methyl-4-phenyl-1H-im...)
Affinity DataIC50:  6.92E+4nM. Assay description: Inhibition of human cathepsin D by FRET based peptide cleavage assay
In DepthDetails ArticlePubMed
TargetBeta-secretase 2(Homo sapiens (Human))
Wyeth Research
Curated by ChEMBL
LigandPNGBDBM50303728(2-amino-4-(3-chlorophenyl)-1-methyl-4-phenyl-1H-im...)
Affinity DataIC50:  420nM. Assay description: Inhibition of human BACE2 by FRET based peptide cleavage assay
In DepthDetails ArticlePubMed
TargetBeta-secretase 1(Homo sapiens (Human))
Merck Research Laboratories
Curated by ChEMBL
LigandPNGBDBM50303728(2-amino-4-(3-chlorophenyl)-1-methyl-4-phenyl-1H-im...)
Affinity DataIC50:  2.50E+3nM. Assay description: Inhibition of human BACE1 by FRET based peptide cleavage assay
In DepthDetails ArticlePubMed
TargetBeta-secretase 1(Homo sapiens (Human))
Merck Research Laboratories
Curated by ChEMBL
LigandPNGBDBM50303728(2-amino-4-(3-chlorophenyl)-1-methyl-4-phenyl-1H-im...)
Affinity DataIC50:  2.50E+3nM. Assay description: Inhibition of human BACE1
In DepthDetails ArticlePubMed