BDBM50303756 (S)-2-amino-4-(4-fluoro-3-(pyrimidin-5-yl)phenyl)-1-methyl-4-(4-(trifluoromethoxy)phenyl)-1H-imidazol-5(4H)-one::CHEMBL566632
SMILES CN1C(N)=N[C@@](C1=O)(c1ccc(OC(F)(F)F)cc1)c1ccc(F)c(c1)-c1cncnc1
InChI Key InChIKey=RNJTYVPMRSKRKE-FQEVSTJZSA-N
Data  3 IC50  1 EC50
  Tab Delimited (TSV)   2D SDfile   Computed 3D by Vconf -m prep SDfile
Find this compound or compounds like it in BindingDB:
Activity Spreadsheet -- Enzyme Inhibition Constant Data from BindingDB
Found 4 hits for monomerid = 50303756
TargetBeta-secretase 1(Homo sapiens (Human))
Wyeth Research
Curated by ChEMBL
LigandPNGBDBM50303756((S)-2-amino-4-(4-fluoro-3-(pyrimidin-5-yl)phenyl)-...)
Affinity DataIC50:  1.39E+3nM. Assay description: Inhibition of human BACE1 by FRET based peptide cleavage assay
In DepthDetails ArticlePubMed
TargetCathepsin D(Homo sapiens (Human))
Wyeth Research
Curated by ChEMBL
LigandPNGBDBM50303756((S)-2-amino-4-(4-fluoro-3-(pyrimidin-5-yl)phenyl)-...)
Affinity DataIC50:  1.16E+4nM. Assay description: Inhibition of human cathepsin D by FRET based peptide cleavage assay
In DepthDetails ArticlePubMed
TargetBeta-secretase 2(Homo sapiens (Human))
Wyeth Research
Curated by ChEMBL
LigandPNGBDBM50303756((S)-2-amino-4-(4-fluoro-3-(pyrimidin-5-yl)phenyl)-...)
Affinity DataIC50:  9.97E+3nM. Assay description: Inhibition of human BACE2 by FRET based peptide cleavage assay
In DepthDetails ArticlePubMed
TargetBeta-secretase 1(Homo sapiens (Human))
Wyeth Research
Curated by ChEMBL
LigandPNGBDBM50303756((S)-2-amino-4-(4-fluoro-3-(pyrimidin-5-yl)phenyl)-...)
Affinity DataEC50:  2.80E+3nM. Assay description: Inhibition of BACE1 expressed in CHOK1 cells coexpressing human recombinant wild type APP assessed as blockade of amyloid beta production by ELISA
In DepthDetails ArticlePubMed