BDBM50303881 4-Amino-1-methyl-2-[2-(5-phosphono)furanyl]benzimidazole::CHEMBL572295
SMILES Cn1c(nc2c(N)cccc12)-c1ccc(o1)P(O)(O)=O
InChI Key InChIKey=MYQLBNKTEVZSMJ-UHFFFAOYSA-N
Data  2 IC50
  Tab Delimited (TSV)   2D SDfile   Computed 3D by Vconf -m prep SDfile
Find this compound or compounds like it in BindingDB:
Activity Spreadsheet -- Enzyme Inhibition Constant Data from BindingDB
Found 2 hits for monomerid = 50303881
TargetFructose-1,6-bisphosphatase 1(Rattus norvegicus)
Metabasis Therapeutics
Curated by ChEMBL
LigandPNGBDBM50303881(4-Amino-1-methyl-2-[2-(5-phosphono)furanyl]benzimi...)
Affinity DataIC50:  2.00E+4nM. Assay description: Inhibition of rat liver FBPase 1
In DepthDetails ArticlePubMed
TargetFructose-1,6-bisphosphatase 1(Homo sapiens (Human))
Metabasis Therapeutics
Curated by ChEMBL
LigandPNGBDBM50303881(4-Amino-1-methyl-2-[2-(5-phosphono)furanyl]benzimi...)
Affinity DataIC50:  6.00E+3nM. Assay description: Inhibition of human liver FBPase 1
In DepthDetails ArticlePubMed